{"text_format":"1","workbook":"xlsx","n_sheets":3,"sheets":["Mapa","Aeros","Calculo"],"not_rendered":{"charts":3,"images":2,"macros":1,"external_links":0,"defined_names":4,"comments":0,"pivot_tables":0},"unopened":[],"bounds":{"document_bytes":16777216,"sheet_cells":100000,"rows_first":2000,"rows_last":500,"rows_between":2000,"halvings":0,"cell_chars":16384,"cell_head_chars":4096},"cells_cut":0,"cells_raw":0,"read":"whole","date_system":"1900"}

{"sheet":"Mapa","index":0,"n_rows":402,"n_cols":5,"rows_kept":402,"cut":false,"hidden":true,"merged":[]}
["Datos de weibull del mapa eólico"]
["Grilla","Altura (m)",null,"k","c"]
["A1",15,{"$f":"A3&B3","v":"A115"},"---","---"]
["A2",15,{"$f":"A4&B4","v":"A215"},2.74,3.9]
["A3",15,"A315",2.7,3.6]
["A4",15,"A415",2.64,3.6]
["A5",15,"A515",2.54,3.9]
["A6",15,"A615","---","---"]
["A7",15,"A715","---","---"]
["A8",15,"A815","---","---"]
["A9",15,"A915","---","---"]
["A0",15,"A015","---","---"]
["B1",15,"B115","---","---"]
["B2",15,"B215",2.74,3.9]
["B3",15,"B315",2.7,3.9]
["B4",15,"B415",2.63,3.7]
["B5",15,"B515",2.5,3.7]
["B6",15,"B615",2.41,3.6]
["B7",15,"B715","---","---"]
["B8",15,"B815","---","---"]
["B9",15,"B915","---","---"]
["B0",15,"B015","---","---"]
["C1",15,"C115","---","---"]
["C2",15,"C215",2.73,4]
["C3",15,"C315",2.7,3.9]
["C4",15,"C415",2.67,3.8]
["C5",15,"C515",2.59,4.4000000000000004]
["C6",15,"C615",2.52,3.4]
["C7",15,"C715",2.6,3.5]
["C8",15,"C815",2.7,3.7]
["C9",15,"C915",0,0]
["C0",15,"C015","---","---"]
["D1",15,"D115",2.74,4.4000000000000004]
["D2",15,"D215",2.71,4.2]
["D3",15,"D315",2.68,4.0999999999999996]
["D4",15,"D415",2.66,4.5999999999999996]
["D5",15,"D515",2.67,4]
["D6",15,"D615",2.69,3.6]
["D7",15,"D715",2.71,4.4000000000000004]
["D8",15,"D815",2.68,4]
["D9",15,"D915",2.68,4]
["D0",15,"D015","---","---"]
["E1",15,"E115",2.69,4.3]
["E2",15,"E215",2.62,4.2]
["E3",15,"E315",2.5499999999999998,4.4000000000000004]
["E4",15,"E415",2.5499999999999998,4.4000000000000004]
["E5",15,"E515",2.59,4.7]
["E6",15,"E615",2.7,4.0999999999999996]
["E7",15,"E715",2.72,4]
["E8",15,"E815",2.61,4.3]
["E9",15,"E915",2.63,4.2]
["E0",15,"E015",2.72,3.9]
["F1",15,"F115","---","---"]
["F2",15,"F215",2.68,4.5]
["F3",15,"F315",2.6,4.4000000000000004]
["F4",15,"F415",2.4700000000000002,4.7]
["F5",15,"F515",2.52,4.5]
["F6",15,"F615",2.71,4.5]
["F7",15,"F715",2.76,4.5]
["F8",15,"F815",2.69,5.2]
["F9",15,"F915",2.69,3.9]
["F0",15,"F015",2.76,4]
["G1",15,"G115",2.62,4.5]
["G2",15,"G215",2.64,4.5999999999999996]
["G3",15,"G315",2.66,4.5999999999999996]
["G4",15,"G415",2.6,4.4000000000000004]
["G5",15,"G515",2.66,4.7]
["G6",15,{"$f":"A68&B68","v":"G615"},2.79,4.7]
["G7",15,"G715",2.85,4.8]
["G8",15,"G815",2.83,3.9]
["G9",15,"G915",2.83,3.9]
["G0",15,"G015","---","---"]
["H1",15,"H115",2.4700000000000002,4.5999999999999996]
["H2",15,"H215",2.46,5]
["H3",15,"H315",2.6,5.4]
["H4",15,"H415",2.74,5.2]
["H5",15,"H515",2.82,4.9000000000000004]
["H6",15,"H615",2.86,5.0999999999999996]
["H7",15,"H715",2.88,4.8]
["H8",15,"H815",2.88,4.8]
["H9",15,"H915",2.89,4.3]
["H0",15,"H015",2.89,4.5]
["I1",15,"I115",2.34,4.9000000000000004]
["I2",15,"I215",2.2599999999999998,4.9000000000000004]
["I3",15,"I315",2.42,4.9000000000000004]
["I4",15,"I415",2.71,4.7]
["I5",15,"I515",2.76,4.9000000000000004]
["I6",15,"I615",2.79,4.9000000000000004]
["I7",15,"I715",2.78,5.8]
["I8",15,"I815",2.8,6.1]
["I9",15,"I915",2.85,4.7]
["I0",15,"I015","---","---"]
["J1",15,"J115","---","---"]
["J2",15,"J215","---","---"]
["J3",15,"J315","---","---"]
["J4",15,"J415",2.69,4.8]
["J5",15,"J515",2.66,5.5]
["J6",15,"J615",2.72,5.2]
["J7",15,"J715",2.61,5.3]
["J8",15,"J815",2.68,5.0999999999999996]
["J9",15,"J915",2.78,4.9000000000000004]
["J0",15,"J015","---","---"]
["A1",30,"A130",0,0]
["A2",30,"A230",2.74,5.3]
["A3",30,"A330",2.7,5.0999999999999996]
["A4",30,"A430",2.63,5]
["A5",30,"A530",2.54,5]
["A6",30,"A630","---","---"]
["A7",30,"A730","---","---"]
["A8",30,"A830","---","---"]
["A9",30,"A930","---","---"]
["A0",30,"A030","---","---"]
["B1",30,"B130","---","---"]
["B2",30,"B230",2.74,5.4]
["B3",30,"B330",2.7,5.3]
["B4",30,"B430",2.63,5]
["B5",30,"B530",2.5,4.9000000000000004]
["B6",30,"B630",2.41,4.9000000000000004]
["B7",30,"B730","---","---"]
["B8",30,"B830","---","---"]
["B9",30,"B930","---","---"]
["B0",30,"B030","---","---"]
["C1",30,"C130","---","---"]
["C2",30,"C230",2.73,5.5]
["C3",30,"C330",2.71,5.4]
["C4",30,"C430",2.67,5.2]
["C5",30,"C530",2.59,5.4]
["C6",30,"C630",2.5099999999999998,4.8]
["C7",30,"C730",2.6,4.9000000000000004]
["C8",30,"C830",2.7,5.0999999999999996]
["C9",30,"C930","---","---"]
["C0",30,{"$f":"A132&B132","v":"C030"},"---","---"]
["D1",30,"D130",2.74,5.8]
["D2",30,"D230",2.72,5.7]
["D3",30,"D330",2.68,5.7]
["D4",30,"D430",2.66,5.8]
["D5",30,"D530",2.67,5.4]
["D6",30,"D630",2.69,5.0999999999999996]
["D7",30,"D730",2.71,5.5]
["D8",30,"D830",2.68,5.5]
["D9",30,"D930",2.68,5.5]
["D0",30,"D030","---","---"]
["E1",30,"E130",2.69,5.9]
["E2",30,"E230",2.63,6]
["E3",30,"E330",2.56,6.1]
["E4",30,"E430",2.56,6.1]
["E5",30,"E530",2.6,6.1]
["E6",30,"E630",2.7,5.6]
["E7",30,"E730",2.71,5.5]
["E8",30,"E830",2.61,5.7]
["E9",30,"E930",2.63,5.6]
["E0",30,"E030",2.72,5.5]
["F1",30,"F130","---","---"]
["F2",30,"F230",2.68,6.1]
["F3",30,"F330",2.6,6.1]
["F4",30,"F430",2.4700000000000002,6.4]
["F5",30,"F530",2.52,6.3]
["F6",30,"F630",2.71,6]
["F7",30,"F730",2.76,5.8]
["F8",30,"F830",2.68,6.1]
["F9",30,"F930",2.69,5.5]
["F0",30,"F030",2.76,5.6]
["G1",30,"G130",2.62,6.1]
["G2",30,"G230",2.64,6.2]
["G3",30,"G330",2.66,6.2]
["G4",30,"G430",2.6,6.2]
["G5",30,"G530",2.66,6.2]
["G6",30,"G630",2.79,6.1]
["G7",30,"G730",2.85,6.1]
["G8",30,"G830",2.83,5.6]
["G9",30,"G930",2.82,5.6]
["G0",30,"G030","---","---"]
["H1",30,"H130",2.4700000000000002,6.4]
["H2",30,"H230",2.46,6.5]
["H3",30,"H330",2.6,6.6]
["H4",30,"H430",2.74,6.4]
["H5",30,"H530",2.82,6.4]
["H6",30,"H630",2.86,6.5]
["H7",30,"H730",2.88,6.3]
["H8",30,"H830",2.88,6.2]
["H9",30,"H930",2.89,6]
["H0",30,"H030",2.89,6]
["I1",30,"I130",2.34,6.6]
["I2",30,"I230",2.25,6.7]
["I3",30,"I330",2.42,6.6]
["I4",30,"I430",2.71,6.5]
["I5",30,"I530",2.77,6.8]
["I6",30,"I630",2.79,6.8]
["I7",30,"I730",2.78,7.1]
["I8",30,"I830",2.81,7.2]
["I9",30,"I930",2.85,6.4]
["I0",30,"I030","---","---"]
["J1",30,"J130","---","---"]
["J2",30,"J230","---","---"]
["J3",30,"J330","---","---"]
["J4",30,{"$f":"A196&B196","v":"J430"},2.69,6.8]
["J5",30,"J530",2.66,7.3]
["J6",30,"J630",2.72,7.1]
["J7",30,"J730",2.62,7.4]
["J8",30,"J830",2.68,7.1]
["J9",30,"J930",2.78,6.7]
["J0",30,"J030","---","---"]
["A1",50,"A150",0,0]
["A2",50,"A250",2.74,6.1]
["A3",50,"A350",2.7,5.8]
["A4",50,"A450",2.63,5.7]
["A5",50,"A550",2.54,5.7]
["A6",50,"A650","---","---"]
["A7",50,"A750","---","---"]
["A8",50,"A850","---","---"]
["A9",50,"A950","---","---"]
["A0",50,"A050","---","---"]
["B1",50,"B150","---","---"]
["B2",50,"B250",2.74,6.1]
["B3",50,"B350",2.7,6]
["B4",50,"B450",2.63,5.8]
["B5",50,"B550",2.5,5.6]
["B6",50,"B650",2.41,5.6]
["B7",50,"B750","---","---"]
["B8",50,"B850","---","---"]
["B9",50,"B950","---","---"]
["B0",50,"B050","---","---"]
["C1",50,"C150","---","---"]
["C2",50,"C250",2.73,6.2]
["C3",50,"C350",2.71,6.1]
["C4",50,"C450",2.67,5.9]
["C5",50,"C550",2.58,6.1]
["C6",50,"C650",2.5099999999999998,5.5]
["C7",50,"C750",2.6,5.7]
["C8",50,"C850",2.7,5.9]
["C9",50,"C950","---","---"]
["C0",50,"C050","---","---"]
["D1",50,"D150",2.75,6.5]
["D2",50,"D250",2.72,6.5]
["D3",50,"D350",2.69,6.4]
["D4",50,"D450",2.66,6.6]
["D5",50,"D550",2.67,6.1]
["D6",50,"D650",2.69,5.9]
["D7",50,"D750",2.71,6.2]
["D8",50,"D850",2.68,6.2]
["D9",50,"D950",2.68,6.2]
["D0",50,"D050","---","---"]
["E1",50,"E150",2.7,6.7]
["E2",50,"E250",2.63,6.7]
["E3",50,"E350",2.57,6.9]
["E4",50,"E450",2.57,6.9]
["E5",50,"E550",2.61,6.9]
["E6",50,"E650",2.71,6.4]
["E7",50,"E750",2.71,6.2]
["E8",50,"E850",2.6,6.4]
["E9",50,"E950",2.62,6.4]
["E0",50,"E050",2.72,6.2]
["F1",50,"F150","---","---"]
["F2",50,"F250",2.69,6.8]
["F3",50,"F350",2.61,6.9]
["F4",50,"F450",2.48,7.2]
["F5",50,"F550",2.5299999999999998,7.1]
["F6",50,"F650",2.71,6.7]
["F7",50,"F750",2.76,6.5]
["F8",50,{"$f":"A260&B260","v":"F850"},2.68,6.8]
["F9",50,"F950",2.69,6.2]
["F0",50,"F050",2.76,6.3]
["G1",50,"G150",2.62,6.9]
["G2",50,"G250",2.64,6.9]
["G3",50,"G350",2.67,7]
["G4",50,"G450",2.61,7]
["G5",50,"G550",2.66,7]
["G6",50,"G650",2.8,6.9]
["G7",50,"G750",2.85,6.8]
["G8",50,"G850",2.83,6.4]
["G9",50,"G950",2.82,6.4]
["G0",50,"G050","---","---"]
["H1",50,"H150",2.46,7.1]
["H2",50,"H250",2.4500000000000002,7.3]
["H3",50,"H350",2.6,7.3]
["H4",50,"H450",2.75,7.2]
["H5",50,"H550",2.82,7.2]
["H6",50,"H650",2.86,7.3]
["H7",50,"H750",2.88,7.1]
["H8",50,"H850",2.89,7]
["H9",50,"H950",2.89,6.8]
["H0",50,"H050",2.89,6.7]
["I1",50,"I150",2.33,7.4]
["I2",50,"I250",2.2400000000000002,7.5]
["I3",50,"I350",2.41,7.4]
["I4",50,"I450",2.71,7.3]
["I5",50,"I550",2.77,7.7]
["I6",50,"I650",2.79,7.7]
["I7",50,"I750",2.78,7.9]
["I8",50,"I850",2.81,8]
["I9",50,"I950",2.85,7.2]
["I0",50,"I050","---","---"]
["J1",50,"J150","---","---"]
["J2",50,"J250","---","---"]
["J3",50,"J350","---","---"]
["J4",50,"J450",2.69,7.7]
["J5",50,"J550",2.66,8.3000000000000007]
["J6",50,"J650",2.72,8]
["J7",50,"J750",2.63,8.1999999999999993]
["J8",50,"J850",2.69,7.9]
["J9",50,"J950",2.79,7.6]
["J0",50,"J050","---","---"]
["A1",90,"A190",0,0]
["A2",90,"A290",2.73,6.8]
["A3",90,"A390",2.7,6.6]
["A4",90,"A490",2.62,6.5]
["A5",90,"A590",2.5299999999999998,6.5]
["A6",90,"A690","---","---"]
["A7",90,"A790","---","---"]
["A8",90,"A890","---","---"]
["A9",90,"A990","---","---"]
["A0",90,"A090","---","---"]
["B1",90,"B190","---","---"]
["B2",90,"B290",2.74,6.9]
["B3",90,"B390",2.7,6.8]
["B4",90,"B490",2.62,6.6]
["B5",90,"B590",2.4900000000000002,6.5]
["B6",90,"B690",2.41,6.4]
["B7",90,"B790","---","---"]
["B8",90,"B890","---","---"]
["B9",90,"B990","---","---"]
["B0",90,"B090","---","---"]
["C1",90,"C190","---","---"]
["C2",90,{"$f":"A324&B324","v":"C290"},2.74,7]
["C3",90,"C390",2.71,6.9]
["C4",90,"C490",2.67,6.7]
["C5",90,"C590",2.58,6.9]
["C6",90,"C690",2.5099999999999998,6.3]
["C7",90,"C790",2.6,6.5]
["C8",90,"C890",2.69,6.6]
["C9",90,"C990","---","---"]
["C0",90,"C090","---","---"]
["D1",90,"D190",2.75,7.3]
["D2",90,"D290",2.72,7.3]
["D3",90,"D390",2.69,7.2]
["D4",90,"D490",2.67,7.3]
["D5",90,"D590",2.67,6.9]
["D6",90,"D690",2.69,6.7]
["D7",90,"D790",2.71,7]
["D8",90,"D890",2.67,7]
["D9",90,"D990",2.67,7]
["D0",90,"D090","---","---"]
["E1",90,"E190",2.7,7.5]
["E2",90,"E290",2.64,7.5]
["E3",90,"E390",2.57,7.7]
["E4",90,"E490",2.57,7.7]
["E5",90,"E590",2.61,7.7]
["E6",90,"E690",2.71,7.2]
["E7",90,"E790",2.71,7]
["E8",90,"E890",2.6,7.2]
["E9",90,"E990",2.62,7.1]
["E0",90,"E090",2.71,7]
["F1",90,"F190","---","---"]
["F2",90,"F290",2.69,7.6]
["F3",90,"F390",2.61,7.7]
["F4",90,"F490",2.4900000000000002,8.1]
["F5",90,"F590",2.54,7.9]
["F6",90,"F690",2.72,7.5]
["F7",90,"F790",2.76,7.3]
["F8",90,"F890",2.67,7.6]
["F9",90,"F990",2.68,7]
["F0",90,"F090",2.76,7.1]
["G1",90,"G190",2.62,7.7]
["G2",90,"G290",2.64,7.7]
["G3",90,"G390",2.67,7.8]
["G4",90,"G490",2.62,7.8]
["G5",90,"G590",2.67,7.9]
["G6",90,"G690",2.8,7.7]
["G7",90,"G790",2.85,7.6]
["G8",90,"G890",2.83,7.2]
["G9",90,"G990",2.72,7.2]
["G0",90,"G090","---","---"]
["H1",90,"H190",2.46,8]
["H2",90,"H290",2.4500000000000002,8.1]
["H3",90,"H390",2.6,8.1]
["H4",90,"H490",2.75,8.1]
["H5",90,"H590",2.82,8.1]
["H6",90,"H690",2.86,8.1999999999999993]
["H7",90,"H790",2.88,8]
["H8",90,"H890",2.89,7.9]
["H9",90,"H990",2.89,7.6]
["H0",90,"H090",2.89,7.6]
["I1",90,"I190",2.3199999999999998,8.3000000000000007]
["I2",90,"I290",2.2400000000000002,8.4]
["I3",90,"I390",2.41,8.1999999999999993]
["I4",90,"I490",2.71,8.3000000000000007]
["I5",90,"I590",2.77,8.6]
["I6",90,{"$f":"A388&B388","v":"I690"},2.8,8.6]
["I7",90,"I790",2.79,8.8000000000000007]
["I8",90,"I890",2.81,8.9]
["I9",90,"I990",2.85,8.1]
["I0",90,"I090","---","---"]
["J1",90,"J190","---","---"]
["J2",90,"J290","---","---"]
["J3",90,"J390","---","---"]
["J4",90,"J490",2.69,8.6]
["J5",90,"J590",2.66,9.4]
["J6",90,"J690",2.72,9.1]
["J7",90,"J790",2.63,9.1999999999999993]
["J8",90,"J890",2.69,8.9]
{"$rows_left_out":3}
{"sheet":"Aeros","index":1,"n_rows":13,"n_cols":30,"rows_kept":13,"cut":false,"hidden":false,"merged":[[0,3,0,28]]}
[null,null,null,"Curva de potencia (kW)"]
[null,null,"Vel (m/s) ->"]
["Aerogenerador","Clase","Categoría",0,1,2,3,4,5,6,7,8,9,10,11,12,13,14,15,16,17,18,19,20,21,22,23,24,25,"Detalles"]
["Standard1","I","Gran escala",0,0,0,0,50,150,300,450,700,950,1280,1600,1850,1970,2000,2000,2000,2000,2000,2000,2000,2000,2000,2000,2000,2000,"S/D"]
["Standard2","II","Gran escala",0,0,0,0,50,200,400,600,850,1200,1580,1820,1950,2000,2000,2000,2000,2000,2000,2000,2000,2000,2000,2000,2000,2000,"S/D"]
["Standard3","III","Gran escala",0,0,0,0,100,240,450,700,1050,1500,1800,1950,2000,2000,2000,2000,2000,2000,2000,2000,2000,2000,2000,2000,2000,2000,"S/D"]
["Aero1","-","Gran escala",null,null,null,null,null,null,null,null,null,null,null,null,null,null,null,null,null,null,null,null,null,null,null,null,null,null,"S/D"]
["Aero2","-","Gran escala",null,null,null,null,null,null,null,null,null,null,null,null,null,null,null,null,null,null,null,null,null,null,null,null,null,null,"S/D"]
["Micro1","-","Microescala",0,0,0,0.02,0.05,0.09,0.17,0.25,0.35,0.45,0.6,0.75,0.78,0.8,0.03,0,0,0,0,0,0,0,0,0,0,0,"S/D"]
["Micro2","-","Microescala",0,0,0,0.06,0.18,0.39,0.60000000000000009,0.89999999999999991,1.2000000000000002,1.56,1.98,2.4000000000000004,3,3.21,1.5,0,0,0,0,0,0,0,0,0,0,0,"S/D"]
["Micro3","-","Microescala",0,0,0,0.05,0.3,0.5,1,1.5,2.4,3.2,4.5,6,6,6,6,6,0,0,0,0,0,0,0,0,0,0,"S/D"]
["Micro4","-","Microescala",null,null,null,null,null,null,null,null,null,null,null,null,null,null,null,null,null,null,null,null,null,null,null,null,null,null,"S/D"]
["Micro5","-","Microescala",null,null,null,null,null,null,null,null,null,null,null,null,null,null,null,null,null,null,null,null,null,null,null,null,null,null,"S/D"]

{"sheet":"Calculo","index":2,"n_rows":30,"n_cols":21,"rows_kept":30,"cut":false,"hidden":false,"merged":[[20,2,20,4],[21,1,22,4],[22,16,22,21],[24,1,24,4],[25,2,25,4],[26,2,26,4],[28,1,30,3],[23,16,30,21],[0,0,0,20],[4,2,4,6],[3,1,3,6],[12,1,12,4],[13,2,13,4],[4,19,4,20],[19,2,19,4],[17,2,17,4],[9,1,9,3],[10,1,10,3],[14,2,14,4],[16,1,16,4],[18,2,18,4]]}
["Simulador de producción energética de un generador eólico en Uruguay"]
[null,null,null,null,null,null,null,null,null,null,null,null,null,null,null,null,null,null,null,null,"Versión 5"]
[]
[null,"Datos del sitio",null,null,null,null,null,null,null,null,null,null,"Vel (m/s)","Weibull","Pot (kW)"]
[null,"Modo de selección",null,null,null,null,null,{"$f":"IF(C5=\"MANUAL\",1,2)","v":2},null,null,null,null,0,{"$f":"($I$9/$I$8)*((M5/$I$8)^($I$9-1))*EXP(-((M5/$I$8)^$I$9))","v":0},{"$f":"VLOOKUP($C$18,Aeros!$A$3:$AC$13,4,FALSE)","v":0},null,null,null,"Impreso:",{"$f":"TODAY()","v":"2011-11-03"}]
[null,{"$f":"IF(C5=\"MANUAL\",\"Ingrese los datos de 'c' y 'k' de Weibull manualmente\",IF(C5 = \"GRILLA MAPA EOLICO\",\"Seleccione la Grilla y Altura del Mapa Eólico, los valores de 'c' y 'k' se calcularán automáticamente\",\"Seleccione modo de ingreso de datos\"))","v":"Seleccione modo de ingreso de datos"},null,null,null,null,null,null,null,null,null,null,1,{"$f":"($I$9/$I$8)*((M6/$I$8)^($I$9-1))*EXP(-((M6/$I$8)^$I$9))","v":3.2778320948294033E-2},{"$f":"VLOOKUP($C$18,Aeros!$A$3:$AC$13,5,FALSE)","v":0}]
[null,null,null,null,null,null,null,null,null,null,null,null,2,{"$f":"($I$9/$I$8)*((M7/$I$8)^($I$9-1))*EXP(-((M7/$I$8)^$I$9))","v":9.9538604811220677E-2},{"$f":"VLOOKUP($C$18,Aeros!$A$3:$AC$13,6,FALSE)","v":0}]
[null,"Grilla del mapa eólico","A",3,null,"c",{"$f":"VLOOKUP($C$8&$D$8&$C$9,Mapa!C3:E402,3,FALSE)","v":5.0999999999999996},null,{"$f":"IF(C5=\"MANUAL\",G10,G8)","v":5.0999999999999996},null,null,null,3,0.1691919615488342,{"$f":"VLOOKUP($C$18,Aeros!$A$3:$AC$13,7,FALSE)","v":0.05}]
[null,"Altura de instalación (m)",30,null,null,"k",{"$f":"VLOOKUP($C$8&$D$8&$C$9,Mapa!C3:E402,2,FALSE)","v":2.7},null,{"$f":"IF(C5=\"MANUAL\",G11,G9)","v":2.7},null,null,null,4,0.20847343259520681,{"$f":"VLOOKUP($C$18,Aeros!$A$3:$AC$13,8,FALSE)","v":0.3}]
[null,"Carga manual de parámetros",null,null,null,"c",7.5,null,null,null,null,null,5,0.19837613736995316,{"$f":"VLOOKUP($C$18,Aeros!$A$3:$AC$13,9,FALSE)","v":0.5}]
[null,null,null,null,null,"k",2.5499999999999998,null,null,null,null,null,6,0.14799846234808761,{"$f":"VLOOKUP($C$18,Aeros!$A$3:$AC$13,10,FALSE)","v":1}]
[null,null,null,null,null,null,null,null,null,null,null,null,7,8.6376166354609957E-2,{"$f":"VLOOKUP($C$18,Aeros!$A$3:$AC$13,11,FALSE)","v":1.5}]
[null,"Datos de viento",null,null,null,null,null,null,null,null,null,null,8,3.9055533863970857E-2,{"$f":"VLOOKUP($C$18,Aeros!$A$3:$AC$13,12,FALSE)","v":2.4}]
[null,"Velocidad media (m/s)",{"$f":"$I$8*EXP(GAMMALN(1+1/$I$9))","v":4.5353436700499632},null,null,null,null,null,null,null,null,null,9,1.3500232472050835E-2,{"$f":"VLOOKUP($C$18,Aeros!$A$3:$AC$13,13,FALSE)","v":3.2}]
[null,"Clase del sitio* (orientativo)",{"$f":"IF(C14>10,\"S\",IF(C14>8.5,\"I\",IF(C14>7.5,\"II\",\"III\")))","v":"III"},null,null,null,null,null,null,null,null,null,10,3.5139423574758548E-3,{"$f":"VLOOKUP($C$18,Aeros!$A$3:$AC$13,14,FALSE)","v":4.5}]
[null,null,null,null,null,null,null,null,null,null,null,null,11,6.7773655095660452E-4,{"$f":"VLOOKUP($C$18,Aeros!$A$3:$AC$13,15,FALSE)","v":6}]
[null,"Aerogenerador",null,null,null,null,null,null,null,null,null,null,12,9.5270659426998643E-5,{"$f":"VLOOKUP($C$18,Aeros!$A$3:$AC$13,16,FALSE)","v":6}]
[null,"Aerogenerador a instalar","Micro3",null,null,null,null,null,null,null,null,null,13,9.5990036063653173E-6,{"$f":"VLOOKUP($C$18,Aeros!$A$3:$AC$13,17,FALSE)","v":6}]
[null,"Clase",{"$f":"VLOOKUP(C18,Aeros!A4:C13,2,FALSE)","v":"-"},null,null,null,null,null,null,null,null,null,14,6.8168550366674696E-7,{"$f":"VLOOKUP($C$18,Aeros!$A$3:$AC$13,18,FALSE)","v":6}]
[null,"Categoría",{"$f":"VLOOKUP(C18,Aeros!A4:C13,3,FALSE)","v":"Microescala"},null,null,null,null,null,null,null,null,null,15,3.3556815992409283E-8,{"$f":"VLOOKUP($C$18,Aeros!$A$3:$AC$13,19,FALSE)","v":6}]
[null,"Potencia máxima (kW)",{"$f":"MAX(O5:O30)","v":6},null,null,null,null,null,null,null,null,null,16,1.1261952773211985E-9,{"$f":"VLOOKUP($C$18,Aeros!$A$3:$AC$13,20,FALSE)","v":0}]
[null,{"$f":"VLOOKUP(C18,Aeros!A4:AD13,30,FALSE)","v":"S/D"},null,null,null,null,null,null,null,null,null,null,17,2.534802606319118E-11,{"$f":"VLOOKUP($C$18,Aeros!$A$3:$AC$13,21,FALSE)","v":0}]
[null,null,null,null,null,null,null,null,null,null,null,null,18,3.7644804925521328E-13,{"$f":"VLOOKUP($C$18,Aeros!$A$3:$AC$13,22,FALSE)","v":0},null,"Notas:"]
[null,null,null,null,null,null,null,null,null,null,null,null,19,3.629989090457297E-15,{"$f":"VLOOKUP($C$18,Aeros!$A$3:$AC$13,23,FALSE)","v":0}]
[null,"Resultados estimados",null,null,null,null,null,null,null,null,null,null,20,2.2368223556569623E-17,{"$f":"VLOOKUP($C$18,Aeros!$A$3:$AC$13,24,FALSE)","v":0}]
[null,"Producción anual",{"$f":"IF(SUMPRODUCT(N5:N30,O5:O30)*8760/1000<10, ROUND(SUMPRODUCT(N5:N30,O5:O30),1)*8760 & \" kWh\", ROUND(SUMPRODUCT(N5:N30,O5:O30)*8760/1000,0) & \" MWh\")","v":"5256 kWh"},null,null,null,null,null,null,null,null,null,21,8.6705751821645254E-20,{"$f":"VLOOKUP($C$18,Aeros!$A$3:$AC$13,25,FALSE)","v":0}]
[null,"Factor de capacidad",{"$f":"SUMPRODUCT(N5:N30,O5:O30)*8760/(MAX(O5:O30)*8760)","v":0.10086651715859579},null,null,null,null,null,null,null,null,null,22,2.081593044368742E-22,{"$f":"VLOOKUP($C$18,Aeros!$A$3:$AC$13,26,FALSE)","v":0}]
[null,null,null,null,null,null,null,null,null,null,null,null,23,3.0478386144547831E-25,{"$f":"VLOOKUP($C$18,Aeros!$A$3:$AC$13,27,FALSE)","v":0}]
[null,"* La clase del sitio se da en formar orientativa y tomando únicamente en cuenta la velocidad media.",null,null,null,null,null,null,null,null,null,null,24,2.6805666571681346E-28,{"$f":"VLOOKUP($C$18,Aeros!$A$3:$AC$13,28,FALSE)","v":0}]
[null,null,null,null,null,null,null,null,null,null,null,null,25,1.3949592538402418E-31,{"$f":"VLOOKUP($C$18,Aeros!$A$3:$AC$13,29,FALSE)","v":0}]